Reaction Details
TargetCoagulation factor XI
LigandBDBM108099
Substrate/Competitorn/a
Meas. Tech.Inhibition Assay
Ki 720±0.0 nM
Citation Herold, PDaghish, MJelakovic, SLudwig, FReichelt, CSchulze, ASchweinitz, A Trypsin-like serine protease inhibitors, and their preparation and use US Patent US8598206 Publication Date 12/3/2013
 
Coagulation factor XI
Name:Coagulation factor XI
Type:Enzyme
Mol. Mass.:70130.58
Organism:Homo sapiens (Human)
Description:P03951
Residue:625
BDBM108099
NameBDBM108099
Synonyms:US8598206, Table 6, 8
TypeSmall organic molecule
Emp. Form.C36H53N7O5S
Mol. Mass.695.915
SMILESCCC(=O)N1CCC(CC[C@@H](NS(=O)(=O)Cc2ccccc2)C(=O)N[C@@H](CCC2CCNCC2)C(=O)NCc2ccc(cc2)C(N)=N)CC1