Reaction Details
TargetCoagulation factor XI
LigandBDBM108108
Substrate/Competitorn/a
Meas. Tech.Inhibition Assay
Ki 1400±0.0 nM
Citation Herold, PDaghish, MJelakovic, SLudwig, FReichelt, CSchulze, ASchweinitz, A Trypsin-like serine protease inhibitors, and their preparation and use US Patent US8598206 Publication Date 12/3/2013
 
Coagulation factor XI
Name:Coagulation factor XI
Type:Enzyme
Mol. Mass.:70130.58
Organism:Homo sapiens (Human)
Description:P03951
Residue:625
BDBM108108
NameBDBM108108
Synonyms:US8598206, 117 | US8598206, 123
TypeSmall organic molecule
Emp. Form.C34H46N7O5S
Mol. Mass.664.838
SMILESNC(=N)c1ccc(CNC(=O)[C@H](CCC2CCNCC2)NC(=O)[C@@H](CCCC2=CC=[N](O)C=C2)NS(=O)(=O)Cc2ccccc2)cc1