Reaction Details
TargetCoagulation factor XII
LigandBDBM108102
Substrate/Competitorn/a
Meas. Tech.Inhibition Assay
Ki 680±0.0 nM
Citation Herold, PDaghish, MJelakovic, SLudwig, FReichelt, CSchulze, ASchweinitz, A Trypsin-like serine protease inhibitors, and their preparation and use US Patent US8598206 Publication Date 12/3/2013
 
Coagulation factor XII
Name:Coagulation factor XII
Type:Enzyme
Mol. Mass.:67810.07
Organism:Homo sapiens (Human)
Description:P00748
Residue:615
BDBM108102
NameBDBM108102
Synonyms:US8598206, Table 6, 11
TypeSmall organic molecule
Emp. Form.C36H53N7O6S
Mol. Mass.711.914
SMILESCOCC(=O)N1CCC(CC[C@@H](NS(=O)(=O)Cc2ccccc2)C(=O)N[C@@H](CCC2CCNCC2)C(=O)NCc2ccc(cc2)C(N)=N)CC1