Reaction Details
TargetTissue-type plasminogen activator
LigandBDBM108098
Substrate/Competitorn/a
Meas. Tech.Inhibition Assay
Ki 6100±0.0 nM
Citation Herold, PDaghish, MJelakovic, SLudwig, FReichelt, CSchulze, ASchweinitz, A Trypsin-like serine protease inhibitors, and their preparation and use US Patent US8598206 Publication Date 12/3/2013
 
Tissue-type plasminogen activator
Name:Tissue-type plasminogen activator
Type:Enzyme
Mol. Mass.:62931.08
Organism:Homo sapiens (Human)
Description:n/a
Residue:562
BDBM108098
NameBDBM108098
Synonyms:US8598206, Table 6, 7
TypeSmall organic molecule
Emp. Form.C37H53N7O5S
Mol. Mass.707.926
SMILESNC(=N)c1ccc(CNC(=O)[C@H](CCC2CCNCC2)NC(=O)[C@@H](CCC2CCN(CC2)C(=O)C2CC2)NS(=O)(=O)Cc2ccccc2)cc1