Reaction Details
TargetLysosomal acid glucosylceramidase
LigandBDBM108215
Substrate/Competitorn/a
Meas. Tech.GCase Ki Assay
pH5.2±0
Ki 33.1±0.0 nM
Citation Li, ZLi, TDai, SXie, XMa, XZhao, WZhang, WLi, JWang, PG New insights into the pharmacological chaperone activity of c2-substituted glucoimidazoles for the treatment of Gaucher disease. Chembiochem14:1239-47 (2013) 
 
Lysosomal acid glucosylceramidase
Name:Lysosomal acid glucosylceramidase
Type:Enzyme
Mol. Mass.:59724.64
Organism:Homo sapiens (Human)
Description:The beta-Glu activity was measured with commercially available beta-glucocerebrosidase (Ceredase) as the enzyme source.
Residue:536
BDBM108215
NameBDBM108215
Synonyms:5-(hydroxymethyl)-5H,6H,7H,8H-imidazo[1,2- a]pyridine-6,7,8-triol (Compound 1)
TypeSmall organic molecule
Emp. Form.C8H12N2O4
Mol. Mass.200.1919
SMILESOCC1C(O)C(O)C(O)c2nccn12