Reaction Details
TargetLysosomal acid glucosylceramidase
LigandBDBM108221
Substrate/Competitorn/a
Meas. Tech.GCase Ki Assay
pH5.2±0
Ki 3.62±0.0 nM
Citation Li, ZLi, TDai, SXie, XMa, XZhao, WZhang, WLi, JWang, PG New insights into the pharmacological chaperone activity of c2-substituted glucoimidazoles for the treatment of Gaucher disease. Chembiochem14:1239-47 (2013) 
 
Lysosomal acid glucosylceramidase
Name:Lysosomal acid glucosylceramidase
Type:Enzyme
Mol. Mass.:59724.64
Organism:Homo sapiens (Human)
Description:The beta-Glu activity was measured with commercially available beta-glucocerebrosidase (Ceredase) as the enzyme source.
Residue:536
BDBM108221
NameBDBM108221
Synonyms:5-(hydroxymethyl)-2-[3-(4-phenylphenyl)propyl]- 5H,6H,7H,8H-imidazo[1,2-a]pyridine-6,7,8-triol (Compound 7)
TypeSmall organic molecule
Emp. Form.C23H26N2O4
Mol. Mass.394.4635
SMILESOCC1C(O)C(O)C(O)c2nc(CCCc3ccc(cc3)-c3ccccc3)cn12