Reaction Details
TargetPrunasin hydrolase
LigandBDBM108223
Substrate/Competitorn/a
Meas. Tech.Inhibition Assay Against Commercial Glycosidases
pH10.6±n/a
Temperature310.15±n/a K
IC50 31±n/a nM
Commentsextracted
Citation Li, ZLi, TDai, SXie, XMa, XZhao, WZhang, WLi, JWang, PG New insights into the pharmacological chaperone activity of c2-substituted glucoimidazoles for the treatment of Gaucher disease. Chembiochem14:1239-47 (2013) 
 
Prunasin hydrolase
Name:Prunasin hydrolase
Type:Protein
Mol. Mass.:61905.54
Organism:Prunus dulcis (Almond)
Description:n/a
Residue:544
BDBM108223
NameBDBM108223
Synonyms:2-[3-(4-fluorophenyl)propyl]-5-(hydroxymethyl)- 5H,6H,7H,8H-imidazo[1,2-a]pyridine-6,7,8-triol (Compound 9)
TypeSmall organic molecule
Emp. Form.C17H21FN2O4
Mol. Mass.336.358
SMILESOCC1C(O)C(O)C(O)c2nc(CCCc3ccc(F)cc3)cn12