Reaction Details
TargetPrunasin hydrolase
LigandBDBM108225
Substrate/Competitorn/a
Meas. Tech.Inhibition Assay Against Commercial Glycosidases
pH10.6±n/a
Temperature310.15±n/a K
IC50 910±n/a nM
Commentsextracted
Citation Li, ZLi, TDai, SXie, XMa, XZhao, WZhang, WLi, JWang, PG New insights into the pharmacological chaperone activity of c2-substituted glucoimidazoles for the treatment of Gaucher disease. Chembiochem14:1239-47 (2013) 
 
Prunasin hydrolase
Name:Prunasin hydrolase
Type:Protein
Mol. Mass.:61905.54
Organism:Prunus dulcis (Almond)
Description:n/a
Residue:544
BDBM108225
NameBDBM108225
Synonyms:2,2-dimethyl-N-phenyl-5-[6,7,8-trihydroxy-5- (hydroxymethyl)-5H,6H,7H,8H-imidazo[1,2-a]pyridin-2- yl]pentanamide (Compound 11)
TypeSmall organic molecule
Emp. Form.C21H29N3O5
Mol. Mass.403.4721
SMILESCC(C)(CCCc1cn2C(CO)C(O)C(O)C(O)c2n1)C(=O)Nc1ccccc1