Reaction Details
TargetOligo-1,6-glucosidase IMA1
LigandBDBM108224
Substrate/Competitorn/a
Meas. Tech.Inhibition Assay Against Commercial Glycosidases
pH10.6±n/a
Temperature310.15±n/a K
IC50 1.05e+3±n/a nM
Commentsextracted
Citation Li, ZLi, TDai, SXie, XMa, XZhao, WZhang, WLi, JWang, PG New insights into the pharmacological chaperone activity of c2-substituted glucoimidazoles for the treatment of Gaucher disease. Chembiochem14:1239-47 (2013) 
 
Oligo-1,6-glucosidase IMA1
Name:Oligo-1,6-glucosidase IMA1
Type:Protein
Mol. Mass.:68577.59
Organism:Saccharomyces cerevisiae S288c (Baker's yeast)
Description:n/a
Residue:589
BDBM108224
NameBDBM108224
Synonyms:N-phenyl-4-[6,7,8-trihydroxy-5-(hydroxymethyl)- 5H,6H,7H,8H-imidazo[1,2-a]pyridin-2-yl]butanamide (Compound 10)
TypeSmall organic molecule
Emp. Form.C18H23N3O5
Mol. Mass.361.3923
SMILESOCC1C(O)C(O)C(O)c2nc(CCCC(=O)Nc3ccccc3)cn12