Reaction Details
Target1-deoxy-D-xylulose-5-phosphate synthase
LigandBDBM108226
Substrate/Competitorn/a
Meas. Tech.DXP Synthase Inhibition Assay
pH8±n/a
Temperature310.15±n/a K
IC50 2.91e+5± 1.1e+4 nM
Commentsextracted
Citation Morris, FVierling, RBoucher, LBosch, JFreel Meyers, CL DXP synthase-catalyzed C-N bond formation: nitroso substrate specificity studies guide selective inhibitor design. Chembiochem14:1309-15 (2013) 
 
1-deoxy-D-xylulose-5-phosphate synthase
Name:1-deoxy-D-xylulose-5-phosphate synthase
Type:Protein
Mol. Mass.:67617.17
Organism:Escherichia coli K-12 (Enterobacteria)
Description:n/a
Residue:620
BDBM108226
NameBDBM108226
Synonyms:1‐methyl‐2‐nitrosobenzene (Substrate 3)
TypeSmall organic molecule
Emp. Form.C7H7NO
Mol. Mass.121.1366
SMILESCc1ccccc1N=O