Reaction Details
Target1-deoxy-D-xylulose-5-phosphate synthase
LigandBDBM108227
Substrate/Competitorn/a
Meas. Tech.DXP Synthase Inhibition Assay
pH8±n/a
Temperature310.15±n/a K
IC50 8.44e+5± 1.70e+5 nM
Commentsextracted
Citation Morris, FVierling, RBoucher, LBosch, JFreel Meyers, CL DXP synthase-catalyzed C-N bond formation: nitroso substrate specificity studies guide selective inhibitor design. Chembiochem14:1309-15 (2013) 
 
1-deoxy-D-xylulose-5-phosphate synthase
Name:1-deoxy-D-xylulose-5-phosphate synthase
Type:Protein
Mol. Mass.:67617.17
Organism:Escherichia coli K-12 (Enterobacteria)
Description:n/a
Residue:620
BDBM108227
NameBDBM108227
Synonyms:NDMA (Substrate 4)
TypeSmall organic molecule
Emp. Form.C8H10N2O
Mol. Mass.150.1778
SMILESCN(C)c1ccc(cc1)N=O