Reaction Details
Target1-deoxy-D-xylulose-5-phosphate synthase
LigandBDBM108228
Substrate/Competitorn/a
Meas. Tech.DXP Synthase Inhibition Assay
pH8±n/a
Temperature310.15±n/a K
Ki 4.22e+5± 8.0e+4 nM
IC50 1.065e+6± 1.90e+5 nM
Commentsextracted
Citation Morris, FVierling, RBoucher, LBosch, JFreel Meyers, CL DXP synthase-catalyzed C-N bond formation: nitroso substrate specificity studies guide selective inhibitor design. Chembiochem14:1309-15 (2013) 
 
1-deoxy-D-xylulose-5-phosphate synthase
Name:1-deoxy-D-xylulose-5-phosphate synthase
Type:Protein
Mol. Mass.:67617.17
Organism:Escherichia coli K-12 (Enterobacteria)
Description:n/a
Residue:620
BDBM108228
NameBDBM108228
Synonyms:1‐nitroso‐2‐naphthol (Substrate 5)
TypeSmall organic molecule
Emp. Form.C10H7NO2
Mol. Mass.173.1681
SMILESOc1ccc2ccccc2c1N=O