Reaction Details
Target1-deoxy-D-xylulose-5-phosphate synthase
LigandBDBM108231
Substrate/Competitorn/a
Meas. Tech.DXP Synthase Inhibition Assay
pH8±n/a
Temperature310.15±n/a K
IC50>2.000e+6±n/a nM
Commentsextracted
Citation Morris, FVierling, RBoucher, LBosch, JFreel Meyers, CL DXP synthase-catalyzed C-N bond formation: nitroso substrate specificity studies guide selective inhibitor design. Chembiochem14:1309-15 (2013) 
 
1-deoxy-D-xylulose-5-phosphate synthase
Name:1-deoxy-D-xylulose-5-phosphate synthase
Type:Protein
Mol. Mass.:67617.17
Organism:Escherichia coli K-12 (Enterobacteria)
Description:n/a
Residue:620
BDBM108231
NameBDBM108231
Synonyms:7‐methoxy‐1‐nitrosonaphthalen‐2‐ol (Substrate 8)
TypeSmall organic molecule
Emp. Form.C11H9NO3
Mol. Mass.203.1941
SMILESCOc1ccc2ccc(O)c(N=O)c2c1