Reaction Details
Target1-deoxy-D-xylulose-5-phosphate synthase
LigandBDBM108232
Substrate/Competitorn/a
Meas. Tech.DXP Synthase Inhibition Assay
pH8±n/a
Temperature310.15±n/a K
IC50>2.000e+6±n/a nM
Commentsextracted
Citation Morris, FVierling, RBoucher, LBosch, JFreel Meyers, CL DXP synthase-catalyzed C-N bond formation: nitroso substrate specificity studies guide selective inhibitor design. Chembiochem14:1309-15 (2013) 
 
1-deoxy-D-xylulose-5-phosphate synthase
Name:1-deoxy-D-xylulose-5-phosphate synthase
Type:Protein
Mol. Mass.:67617.17
Organism:Escherichia coli K-12 (Enterobacteria)
Description:n/a
Residue:620
BDBM108232
NameBDBM108232
Synonyms:1‐isopropyl‐3,5‐dimethyl‐4‐nitrosopyrazole (Substrate 9)
TypeSmall organic molecule
Emp. Form.C8H13N3O
Mol. Mass.167.2083
SMILESCC(C)n1nc(C)c(N=O)c1C