Reaction Details
TargetHistone H1.0
LigandBDBM21398
Substrate/Competitorn/a
Meas. Tech.Binding Assay
Ki 780±0.0 nM
Citation Mates, SFienberg, AWennogle, L Methods and compositions for sleep disorders and other disorders US Patent US8598119 Publication Date 12/3/2013
 
Histone H1.0
Name:Histone H1.0
Type:Cell-surface receptors
Mol. Mass.:20917.09
Organism:Homo sapiens (Human)
Description:P07305
Residue:194
BDBM21398
NameBDBM21398
Synonyms:4-[4-(4-Chloro-phenyl)-4-hydroxy-piperidin-1-yl]-1-(4-fluoro-phenyl)-butan-1-one;propionate(HCl) CHEMBL54 Haloperidol | Haloperidol, 1
TypeSmall organic molecule
Emp. Form.C21H23ClFNO2
Mol. Mass.375.864
SMILESOC1(CCN(CCCC(=O)c2ccc(F)cc2)CC1)c1ccc(Cl)cc1