Reaction Details
TargetHistone H1.0
LigandBDBM50095890
Substrate/Competitorn/a
Meas. Tech.Binding Assay
Ki 10±0.0 nM
Citation Mates, SFienberg, AWennogle, L Methods and compositions for sleep disorders and other disorders US Patent US8598119 Publication Date 12/3/2013
 
Histone H1.0
Name:Histone H1.0
Type:Cell-surface receptors
Mol. Mass.:20917.09
Organism:Homo sapiens (Human)
Description:P07305
Residue:194
BDBM50095890
NameBDBM50095890
Synonyms:2-[2-(4-Dibenzo[b,f][1,4]thiazepin-11-yl-1-piperazinyl)ethoxy]ethanol CHEMBL716 | QUETIAPINE
TypeSmall organic molecule
Emp. Form.C21H25N3O2S
Mol. Mass.383.507
SMILESOCCOCCN1CCN(CC1)C1=Nc2ccccc2Sc2ccccc12