Reaction Details
TargetTyrosine-protein kinase BTK
LigandBDBM281758
Substrate/Competitorn/a
Meas. Tech.Human Recombinant Btk Enzyme Assay
pH7.4±n/a
Temperature298.15±n/a K
IC50 0.029±n/a nM
Commentsextracted
Citation Watterson, SHTebben, AJAhmad, S Carbazole and tetrahydrocarbazole compounds useful as inhibitors of BTK US Patent US10023534 Publication Date 7/17/2018
 
Tyrosine-protein kinase BTK
Name:Tyrosine-protein kinase BTK
Type:Enzyme
Mol. Mass.:76289.95
Organism:Homo sapiens (Human)
Description:Q06187
Residue:659
BDBM281758
NameBDBM281758
Synonyms:4-(2-acryloyl-1,2,3,4- tetrahydroisoquinolin- 5-yl)-3-fluoro-7-(2- fluoroethyl)-9H- carbazole-1- carboxamide | US10023534, Example 26
TypeSmall organic molecule
Emp. Form.C27H23F2N3O2
Mol. Mass.459.4872
SMILESNC(=O)c1cc(F)c(-c2cccc3CN(CCc23)C(=O)C=C)c2c3ccc(CCF)cc3[nH]c12