Reaction Details
TargetHistamine H3 receptor
LigandBDBM108283
Substrate/Competitorn/a
Meas. Tech.Radioligand Binding Assay
Ki 0.1±0.0 nM
Citation Gao, ZHall, DHartung, R Substituted piperidine spiro pyrrolidinone and piperidinone, preparation and therapeutic use thereof US Patent US8604046 Publication Date 12/10/2013
 
Histamine H3 receptor
Name:Histamine H3 receptor
Synonyms:n/a
Type:Enzyme
Mol. Mass.:43426.88
Organism:Macaca mulatta (Rhesus macaque)
Description:G7N499
Residue:390
BDBM108283
NameBDBM108283
Synonyms:US8604046, 63
TypeSmall organic molecule
Emp. Form.C24H36N4O
Mol. Mass.396.5688
SMILESC[C@H]1CCCN1[C@H]1CCN(C1)c1ccc(cc1)N1CCCC2(CCNCC2)C1=O