Reaction Details
TargetHistamine H3 receptor
LigandBDBM108305
Substrate/Competitorn/a
Meas. Tech.Radioligand Binding Assay
Ki 0.1±0.0 nM
Citation Gao, ZHall, DHartung, R Substituted piperidine spiro pyrrolidinone and piperidinone, preparation and therapeutic use thereof US Patent US8604046 Publication Date 12/10/2013
 
Histamine H3 receptor
Name:Histamine H3 receptor
Synonyms:n/a
Type:Enzyme
Mol. Mass.:43426.88
Organism:Macaca mulatta (Rhesus macaque)
Description:G7N499
Residue:390
BDBM108305
NameBDBM108305
Synonyms:US8604046, 85
TypeSmall organic molecule
Emp. Form.C24H35FN4O
Mol. Mass.414.5593
SMILESC[C@H]1CCCN1C1CCN(CC1)c1ccc(N2CCC3(CCNCC3)C2=O)c(F)c1