Reaction Details
TargetLysosomal acid glucosylceramidase
LigandBDBM108418
Substrate/Competitorn/a
Meas. Tech.Enzyme Inhibition Assay
pH7±0
Ki 4± 0.1 nM
IC50 7± 0.3 nM
Citation Boyd, RLee, GRybczynski, P Compositions for preventing and/or treating degenerative disorders of the central nervous system US Patent US8604206 Publication Date 12/10/2013
 
Lysosomal acid glucosylceramidase
Name:Lysosomal acid glucosylceramidase
Type:Enzyme
Mol. Mass.:59724.64
Organism:Homo sapiens (Human)
Description:The beta-Glu activity was measured with commercially available beta-glucocerebrosidase (Ceredase) as the enzyme source.
Residue:536
BDBM108418
NameBDBM108418
Synonyms:US8604206, 13 | US8604206, 14
TypeSmall oganic molecule
Emp. Form.C7H14FNO2
Mol. Mass.163.19
SMILESCC(F)[C@H]1CNC[C@@H](O)[C@@H]1O