Reaction Details
TargetRAC-alpha serine/threonine-protein kinase
LigandBDBM108436
Substrate/Competitorn/a
Meas. Tech.Alpha Screen Assay
pH8±0
Temperature298.15±0 K
IC50 1.84±n/a nM
Citation Ashwell, MABrassard, CFilikov, AHill, JKoerner, SLapierre, JLiu, YNamdev, NNicewonger, RPalma, RTandon, MVensel, DMatsuda, AIimura, SYoshida, KYamazaki, TKitamura, TIsoyama, T Substituted imidazopyridinyl-aminopyridine compounds US Patent US8609688 Publication Date 12/17/2013
 
RAC-alpha serine/threonine-protein kinase
Name:RAC-alpha serine/threonine-protein kinase
Type:Enzyme
Mol. Mass.:55681.25
Organism:Homo sapiens (Human)
Description:P31749
Residue:480
BDBM108436
NameBDBM108436
Synonyms:US8609688, 14
TypeSmall organic molecule
Emp. Form.C35H36N8O
Mol. Mass.584.7133
SMILESNc1ncccc1-c1nc2ccc(nc2n1-c1ccc(cc1)C1(N)CCC1)-c1cccc(c1)N1CCN(CC1)C(=O)C1CC1