Reaction Details
TargetGlutaminase kidney isoform, mitochondrial
LigandBDBM108804
Substrate/Competitorn/a
Meas. Tech.Enzyme Assay-Time Dependence
IC50 3±n/a nM
Citation Li, JChen, LGoyal, BLaidig, GStanton, TFSjogren, EB Heterocyclic inhibitors of glutaminase US Patent US8604016 Publication Date 12/10/2013
 
Glutaminase kidney isoform, mitochondrial
Name:Glutaminase kidney isoform, mitochondrial
Type:Protein
Mol. Mass.:73471.89
Organism:Homo sapiens (Human)
Description:O94925
Residue:669
BDBM108804
NameBDBM108804
Synonyms:US8604016, 384 | US9938267, Cmpd ID 384
TypeSmall organic molecule
Emp. Form.C30H33N7O4S
Mol. Mass.587.693
SMILESCCOC(=O)NCc1cccc(CC(=O)Nc2ccc(CCCCc3nnc(NC(=O)Cc4ccccc4)s3)nn2)c1