Reaction Details
TargetGlutaminase kidney isoform, mitochondrial
LigandBDBM108895
Substrate/Competitorn/a
Meas. Tech.Enzyme Assay-Time Dependence
IC50 2±n/a nM
Citation Li, JChen, LGoyal, BLaidig, GStanton, TFSjogren, EB Heterocyclic inhibitors of glutaminase US Patent US8604016 Publication Date 12/10/2013
 
Glutaminase kidney isoform, mitochondrial
Name:Glutaminase kidney isoform, mitochondrial
Type:Protein
Mol. Mass.:73471.89
Organism:Homo sapiens (Human)
Description:O94925
Residue:669
BDBM108895
NameBDBM108895
Synonyms:US8604016, 475 | US9938267, Cmpd ID 475
TypeSmall organic molecule
Emp. Form.C32H30BrN9O3S
Mol. Mass.700.608
SMILESBrc1ccc(nn1)C(=O)NCc1cccc(CC(=O)Nc2nnc(CCCCc3ccc(NC(=O)Cc4ccccc4)nn3)s2)c1