Reaction Details
TargetGlutaminase kidney isoform, mitochondrial
LigandBDBM108905
Substrate/Competitorn/a
Meas. Tech.Enzyme Assay-Time Dependence
IC50 4±n/a nM
Citation Li, JChen, LGoyal, BLaidig, GStanton, TFSjogren, EB Heterocyclic inhibitors of glutaminase US Patent US8604016 Publication Date 12/10/2013
 
Glutaminase kidney isoform, mitochondrial
Name:Glutaminase kidney isoform, mitochondrial
Type:Protein
Mol. Mass.:73471.89
Organism:Homo sapiens (Human)
Description:O94925
Residue:669
BDBM108905
NameBDBM108905
Synonyms:US8604016, 486 | US9938267, Cmpd ID 486
TypeSmall organic molecule
Emp. Form.C31H35N7O3S
Mol. Mass.585.72
SMILESCCN(C)C(=O)Cc1cccc(CC(=O)Nc2nnc(CCCCc3ccc(NC(=O)Cc4ccccc4)nn3)s2)c1