Reaction Details
TargetGlutaminase kidney isoform, mitochondrial
LigandBDBM108960
Substrate/Competitorn/a
Meas. Tech.Enzyme Assay-Time Dependence
IC50 4±n/a nM
Citation Li, JChen, LGoyal, BLaidig, GStanton, TFSjogren, EB Heterocyclic inhibitors of glutaminase US Patent US8604016 Publication Date 12/10/2013
 
Glutaminase kidney isoform, mitochondrial
Name:Glutaminase kidney isoform, mitochondrial
Type:Protein
Mol. Mass.:73471.89
Organism:Homo sapiens (Human)
Description:O94925
Residue:669
BDBM108960
NameBDBM108960
Synonyms:US8604016, 542 | US9938267, Cmpd ID 542
TypeSmall organic molecule
Emp. Form.C32H37N7O3S
Mol. Mass.599.746
SMILESCC(C)(C)NC(=O)Cc1cccc(CC(=O)Nc2ccc(CCCCc3nnc(NC(=O)Cc4ccccc4)s3)nn2)c1