Reaction Details
TargetGlutaminase kidney isoform, mitochondrial
LigandBDBM108973
Substrate/Competitorn/a
Meas. Tech.Enzyme Assay-Time Dependence
IC50 4±n/a nM
Citation Li, JChen, LGoyal, BLaidig, GStanton, TFSjogren, EB Heterocyclic inhibitors of glutaminase US Patent US8604016 Publication Date 12/10/2013
 
Glutaminase kidney isoform, mitochondrial
Name:Glutaminase kidney isoform, mitochondrial
Type:Protein
Mol. Mass.:73471.89
Organism:Homo sapiens (Human)
Description:O94925
Residue:669
BDBM108973
NameBDBM108973
Synonyms:US8604016, 555 | US9938267, Cmpd ID 555
TypeSmall organic molecule
Emp. Form.C31H35N7O4S
Mol. Mass.601.719
SMILESCCOC(=O)NCc1cccc(CC(=O)Nc2ccc(CCCCc3nnc(NC(=O)C(C)c4ccccc4)s3)nn2)c1