Reaction Details
TargetGlutaminase kidney isoform, mitochondrial
LigandBDBM108980
Substrate/Competitorn/a
Meas. Tech.Enzyme Assay-Time Dependence
IC50 3±n/a nM
Citation Li, JChen, LGoyal, BLaidig, GStanton, TFSjogren, EB Heterocyclic inhibitors of glutaminase US Patent US8604016 Publication Date 12/10/2013
 
Glutaminase kidney isoform, mitochondrial
Name:Glutaminase kidney isoform, mitochondrial
Type:Protein
Mol. Mass.:73471.89
Organism:Homo sapiens (Human)
Description:O94925
Residue:669
BDBM108980
NameBDBM108980
Synonyms:US8604016, 561 | US9938267, Cmpd ID 562
TypeSmall organic molecule
Emp. Form.C31H35N7O4S
Mol. Mass.601.719
SMILESCCOC(=O)NC(C)c1cccc(CC(=O)Nc2nnc(CCCCc3ccc(NC(=O)Cc4ccccc4)nn3)s2)c1