Reaction Details
TargetGlutaminase kidney isoform, mitochondrial
LigandBDBM108982
Substrate/Competitorn/a
Meas. Tech.Enzyme Assay-Time Dependence
IC50 4±n/a nM
Citation Li, JChen, LGoyal, BLaidig, GStanton, TFSjogren, EB Heterocyclic inhibitors of glutaminase US Patent US8604016 Publication Date 12/10/2013
 
Glutaminase kidney isoform, mitochondrial
Name:Glutaminase kidney isoform, mitochondrial
Type:Protein
Mol. Mass.:73471.89
Organism:Homo sapiens (Human)
Description:O94925
Residue:669
BDBM108982
NameBDBM108982
Synonyms:US8604016, 564 | US9938267, Cmpd ID 564
TypeSmall organic molecule
Emp. Form.C32H37N7O3S
Mol. Mass.599.746
SMILESCC(C)(C)C(=O)NCc1cccc(CC(=O)Nc2nnc(CCCCc3ccc(NC(=O)Cc4ccccc4)nn3)s2)c1