Reaction Details
TargetGlutaminase kidney isoform, mitochondrial
LigandBDBM109041
Substrate/Competitorn/a
Meas. Tech.Enzyme Assay-Time Dependence
IC50 3±n/a nM
Citation Li, JChen, LGoyal, BLaidig, GStanton, TFSjogren, EB Heterocyclic inhibitors of glutaminase US Patent US8604016 Publication Date 12/10/2013
 
Glutaminase kidney isoform, mitochondrial
Name:Glutaminase kidney isoform, mitochondrial
Type:Protein
Mol. Mass.:73471.89
Organism:Homo sapiens (Human)
Description:O94925
Residue:669
BDBM109041
NameBDBM109041
Synonyms:US8604016, 623
TypeSmall organic molecule
Emp. Form.C30H38N6O5S2
Mol. Mass.626.79
SMILESCS(=O)(=O)CCCOc1cccc(CC(=O)NC(=N)CCC(=N)CCCCc2nnc(NC(=O)Cc3ccccc3)s2)c1