Reaction Details
TargetGlutaminase kidney isoform, mitochondrial
LigandBDBM109082
Substrate/Competitorn/a
Meas. Tech.Enzyme Assay-Time Dependence
IC50 4±n/a nM
Citation Li, JChen, LGoyal, BLaidig, GStanton, TFSjogren, EB Heterocyclic inhibitors of glutaminase US Patent US8604016 Publication Date 12/10/2013
 
Glutaminase kidney isoform, mitochondrial
Name:Glutaminase kidney isoform, mitochondrial
Type:Protein
Mol. Mass.:73471.89
Organism:Homo sapiens (Human)
Description:O94925
Residue:669
BDBM109082
NameBDBM109082
Synonyms:US10793535, Cmpd ID 666 US9938267, Cmpd ID 666
TypeSmall organic molecule
Emp. Form.C27H26F2N6O3S
Mol. Mass.552.596
SMILESFC(F)Oc1cccc(CC(=O)Nc2ccc(CCCCc3nnc(NC(=O)Cc4ccccc4)s3)nn2)c1