Reaction Details
TargetMetabotropic glutamate receptor 5
LigandBDBM109120
Substrate/Competitorn/a
Meas. Tech.Binding Assay
Temperature298.15±n/a K
Ki 1.0±0.0 nM
Commentsextracted
Citation Cosford, NDSeiders, TJPayne, JERoppe, JRHuang, DSmith, NDPoon, SFKing, CEastman, BWWang, BArruda, JMVernier, JZhao, X Thiazolyl mGluR5 antagonists and methods for their use US Patent US8609852 Publication Date 12/17/2013
 
Metabotropic glutamate receptor 5
Name:Metabotropic glutamate receptor 5
Type:Enzyme
Mol. Mass.:131900.14
Organism:Rattus norvegicus (Rat)
Description:P31424
Residue:1203
BDBM109120
NameBDBM109120
Synonyms:US8609852, 27
TypeSmall organic molecule
Emp. Form.C15H16N2OS
Mol. Mass.272.365
SMILESCc1nc(cs1)C#Cc1ccc(OC(C)(C)C)nc1