Reaction Details
TargetMetabotropic glutamate receptor 5
LigandBDBM50123009
Substrate/Competitorn/a
Meas. Tech.Binding Assay
Temperature298.15±n/a K
Ki 3±0.0 nM
Commentsextracted
Citation Cosford, NDSeiders, TJPayne, JERoppe, JRHuang, DSmith, NDPoon, SFKing, CEastman, BWWang, BArruda, JMVernier, JZhao, X Thiazolyl mGluR5 antagonists and methods for their use US Patent US8609852 Publication Date 12/17/2013
 
Metabotropic glutamate receptor 5
Name:Metabotropic glutamate receptor 5
Type:Enzyme
Mol. Mass.:131900.14
Organism:Rattus norvegicus (Rat)
Description:P31424
Residue:1203
BDBM50123009
NameBDBM50123009
Synonyms:3-Methyl-5-(2-methyl-thiazol-4-ylethynyl)-pyridine US8609852, 80
TypeSmall organic molecule
Emp. Form.C12H10N2S
Mol. Mass.214.286
SMILESCc1nc(cs1)C#Cc1cncc(C)c1