Reaction Details
TargetAurora kinase A
LigandBDBM109209
Substrate/Competitorn/a
Meas. Tech.Inhibition Assay Protocol B
Temperature303.15±n/a K
IC50 0.6±0 nM
Commentsextracted
Citation Lavogina, DEnkvist, EViht, KUri, A Long residence times revealed by Aurora A kinase-targeting fluorescent probes derived from inhibitors MLN8237 and VX-689. Chembiochem15:443-50 (2014) 
 
Aurora kinase A
Name:Aurora kinase A
Type:Serine/threonine-protein kinase
Mol. Mass.:45830.98
Organism:Homo sapiens (Human)
Description:O14965
Residue:403
BDBM109209
NameBDBM109209
Synonyms:VX-689
TypeSmall organic molecule
Emp. Form.C22H21ClFN3O3S
Mol. Mass.461.937
SMILESOC(=O)[C@]1(Cc2cccc(Nc3nccs3)n2)CCC(CC1)Oc1cccc(Cl)c1F