Reaction Details
TargetAurora kinase A/Targeting protein for Xklp2 [1-43]
LigandBDBM109208
Substrate/Competitorn/a
Meas. Tech.Dissociation Kinetics Assay
Temperature303.15±n/a K
Kd 0.544±0.022 nM
Commentsextracted
Citation Lavogina, DEnkvist, EViht, KUri, A Long residence times revealed by Aurora A kinase-targeting fluorescent probes derived from inhibitors MLN8237 and VX-689. Chembiochem15:443-50 (2014) 
 
Aurora kinase A/Targeting protein for Xklp2 [1-43]
Name:Aurora kinase A/Targeting protein for Xklp2 [1-43]
Synonyms:Aurora A/TPX2 (1-43)
Type:n/a
Mol. Mass.:n/a
Description:n/a
Components:This complex has 2 components.
Component 1
Name:Aurora kinase A
Type:Serine/threonine-protein kinase
Mol. Mass.:45830.98
Organism:Homo sapiens (Human)
Description:O14965
Residue:403
Component 2
Name:Targeting protein for Xklp2 [1-43]
Synonyms:C20orf1 DIL2 Microtubule-associated TPX2 (aa 1-43) | TPX2_HUMAN
Type:Protein
Mol. Mass.:4917.03
Organism:Homo sapiens (Human)
Description:Q9ULW0[1-43]
Residue:43
BDBM109208
NameBDBM109208
Synonyms:2-[(1E,3E)-5-[(2E)-3-(3-{[(5R)-5-carbamoyl-5-{[4- (3-chloro-2-fluorophenoxy)-1-{[6-(1,3-thiazol-2- ylamino)pyridin-2- yl]methyl}cyclohexyl]formamido}pentyl]carbamoyl}propyl)-1- ethyl-3-methyl-5-sulfoindol-2-ylidene]penta-1,3- dien-1-yl]-1-ethyl-3,3-dimethylindol-1-ium-5- sulfonate (Compound III) | Compound III: VX-689*-D-Lys(PromoFluor 647)-NH2
TypeSmall organic molecule
Emp. Form.C60H70ClFN8O10S3
Mol. Mass.1213.892
SMILESCCN1\C(=C\C=C\C=C\C2=[N+](CC)c3ccc(cc3C2(C)C)S([O-])(=O)=O)C(C)(CCCC(=O)NCCCC[C@@H](NC(=O)[C@]2(Cc3cccc(Nc4nccs4)n3)CCC(CC2)Oc2cccc(Cl)c2F)C(N)=O)c2cc(ccc12)S(O)(=O)=O