Reaction Details
TargetInduced myeloid leukemia cell differentiation protein Mcl-1
LigandBDBM21447
Substrate/Competitorn/a
Meas. Tech.AlphaScreen Assay (AS)
pH7.4±n/a
Temperature298.15±n/a K
IC50>10000±0 nM
Commentsextracted
Citation Lessene, GCzabotar, PESleebs, BEZobel, KLowes, KNAdams, JMBaell, JBColman, PMDeshayes, KFairbrother, WJFlygare, JAGibbons, PKersten, WJKulasegaram, SMoss, RMParisot, JPSmith, BJStreet, IPYang, HHuang, DCWatson, KG Structure-guided design of a selective BCL-X(L) inhibitor. Nat Chem Biol9:390-7 (2013) 
 
Induced myeloid leukemia cell differentiation protein Mcl-1
Name:Induced myeloid leukemia cell differentiation protein Mcl-1
Type:Membrane; Single-pass membrane protein
Mol. Mass.:37332.87
Organism:Homo sapiens (Human)
Description:Q07820
Residue:350
BDBM21447
NameBDBM21447
Synonyms:4-(4-{[2-(4-chlorophenyl)phenyl]methyl}piperazin-1-yl)-N-[(4-{[(2R)-4-(dimethylamino)-1-(phenylsulfanyl)butan-2-yl]amino}-3-nitrobenzene)sulfonyl]benzamide CHEMBL376408 US11760752, Compound ABT-737 | US9125913, ABT-737
TypeSmall organic molecule
Emp. Form.C42H45ClN6O5S2
Mol. Mass.813.427
SMILESCN(C)CC[C@H](CSc1ccccc1)Nc1ccc(cc1[N+]([O-])=O)S(=O)(=O)NC(=O)c1ccc(cc1)N1CCN(Cc2ccccc2-c2ccc(Cl)cc2)CC1