Reaction Details
TargetTransmembrane prolyl 4-hydroxylase
LigandBDBM109268
Substrate/Competitorn/a
Meas. Tech.Inhibition Assay
IC50 2.6e+2±n/a nM
Citation Thede, KFlamme, IOehme, FErgüden, JStoll, FWild, HKolkhof, PBeck, HJeske, M Substituted dipyridyl-dihydropyrazolones and use thereof US Patent US8609698 Publication Date 12/17/2013
 
Transmembrane prolyl 4-hydroxylase
Name:Transmembrane prolyl 4-hydroxylase
Type:Enzyme
Mol. Mass.:56654.25
Organism:Homo sapiens (Human)
Description:Q9NXG6
Residue:502
BDBM109268
NameBDBM109268
Synonyms:US8609698, 10
TypeSmall organic molecule
Emp. Form.C14H9BrN4O3
Mol. Mass.361.15
SMILESOC(=O)c1ccc(nc1)-n1[nH]cc(-c2cncc(Br)c2)c1=O