Reaction Details
TargetTransmembrane prolyl 4-hydroxylase
LigandBDBM109269
Substrate/Competitorn/a
Meas. Tech.Inhibition Assay
IC50 9.1e+2±n/a nM
Citation Thede, KFlamme, IOehme, FErgüden, JStoll, FWild, HKolkhof, PBeck, HJeske, M Substituted dipyridyl-dihydropyrazolones and use thereof US Patent US8609698 Publication Date 12/17/2013
 
Transmembrane prolyl 4-hydroxylase
Name:Transmembrane prolyl 4-hydroxylase
Type:Enzyme
Mol. Mass.:56654.25
Organism:Homo sapiens (Human)
Description:Q9NXG6
Residue:502
BDBM109269
NameBDBM109269
Synonyms:US8609698, 18
TypeSmall organic molecule
Emp. Form.C18H19N5O2
Mol. Mass.337.3758
SMILESCC(C)(C)NC(=O)c1ccc(nc1)-n1[nH]cc(-c2cccnc2)c1=O