Reaction Details
TargetSGLT1 protein
LigandBDBM109277
Substrate/Competitorn/a
Meas. Tech.Inhibition Assay
IC50 2600±0.0 nM
Citation Yang, FTang, PCDong, QTu, WFan, JGuan, DShen, GWang, YYuan, JZhang, L C-aryl glucoside derivatives, preparation process and pharmaceutical use thereof US Patent US8609622 Publication Date 12/17/2013
 
SGLT1 protein
Name:SGLT1 protein
Type:Protein
Mol. Mass.:73320.01
Organism:Mus musculus (Mouse)
Description:Q9QXI6
Residue:665
BDBM109277
NameBDBM109277
Synonyms:US8609622, 4
TypeSmall organic molecule
Emp. Form.C22H24ClFO7
Mol. Mass.454.873
SMILESCCOc1ccc(Cc2cc(ccc2Cl)C23OC[C@@](CO)(O2)[C@@H](O)[C@H](O)[C@H]3O)cc1F