Reaction Details
TargetSGLT1 protein
LigandBDBM109279
Substrate/Competitorn/a
Meas. Tech.Inhibition Assay
IC50 14260±0.0 nM
Citation Yang, FTang, PCDong, QTu, WFan, JGuan, DShen, GWang, YYuan, JZhang, L C-aryl glucoside derivatives, preparation process and pharmaceutical use thereof US Patent US8609622 Publication Date 12/17/2013
 
SGLT1 protein
Name:SGLT1 protein
Type:Protein
Mol. Mass.:73320.01
Organism:Mus musculus (Mouse)
Description:Q9QXI6
Residue:665
BDBM109279
NameBDBM109279
Synonyms:US8609622, 7
TypeSmall organic molecule
Emp. Form.C22H22ClF3O7
Mol. Mass.490.854
SMILESOC[C@]12COC(O1)([C@H](O)[C@@H](O)[C@@H]2O)c1ccc(Cl)c(Cc2ccc(OCC(F)(F)F)cc2)c1