Reaction Details
TargetPhosphatidylinositol 4,5-bisphosphate 3-kinase catalytic subunit alpha isoform
LigandBDBM109317
Substrate/Competitorn/a
Meas. Tech.Biological Assays
IC50 10±n/a nM
Citation Montagne, CBombrun, ADesforges-Bouscary, GQuattropani, AGaillard, P 2-morpholino-pyrido[3,2-D]pyrimidines US Patent US8609666 Publication Date 12/17/2013
 
Phosphatidylinositol 4,5-bisphosphate 3-kinase catalytic subunit alpha isoform
Name:Phosphatidylinositol 4,5-bisphosphate 3-kinase catalytic subunit alpha isoform
Type:Enzyme Subunit
Mol. Mass.:124294.87
Organism:Homo sapiens (Human)
Description:P42336
Residue:1068
BDBM109317
NameBDBM109317
Synonyms:US8609666, 37
TypeSmall organic molecule
Emp. Form.C21H22FN5O5
Mol. Mass.443.4283
SMILESCN(CCO)c1cc(nc2c(nc(nc12)N1CCOCC1)-c1cccc(F)c1O)C(O)=O