Reaction Details
TargetTrace amine-associated receptor 1
LigandBDBM109390
Substrate/Competitorn/a
Meas. Tech.Radioligand Binding Assay
Ki 0.4±n/a nM
Citation Galley, GGroebke Zbinden, KNorcross, RStalder, H 2-aminooxazolines as TAAR1 ligands US Patent US8604061 Publication Date 12/10/2013
 
Trace amine-associated receptor 1
Name:Trace amine-associated receptor 1
Type:Protein
Mol. Mass.:37635.41
Organism:Mus musculus (Mouse)
Description:Q923Y8
Residue:332
BDBM109390
NameBDBM109390
Synonyms:US8604061, 103
TypeSmall organic molecule
Emp. Form.C13H12N2O
Mol. Mass.212.2472
SMILESNC1=N[C@H](CO1)c1ccc2ccccc2c1