Reaction Details
TargetTrace amine-associated receptor 1
LigandBDBM109446
Substrate/Competitorn/a
Meas. Tech.Radioligand Binding Assay
Ki 0.4±n/a nM
Citation Galley, GGroebke Zbinden, KNorcross, RStalder, H 2-aminooxazolines as TAAR1 ligands US Patent US8604061 Publication Date 12/10/2013
 
Trace amine-associated receptor 1
Name:Trace amine-associated receptor 1
Type:Protein
Mol. Mass.:37635.41
Organism:Mus musculus (Mouse)
Description:Q923Y8
Residue:332
BDBM109446
NameBDBM109446
Synonyms:US8604061, 178
TypeSmall organic molecule
Emp. Form.C9H8ClFN2O
Mol. Mass.214.624
SMILESNC1=N[C@H](CO1)c1cc(F)cc(Cl)c1