Reaction Details
TargetTrace amine-associated receptor 1
LigandBDBM109462
Substrate/Competitorn/a
Meas. Tech.Radioligand Binding Assay
Ki 0.2±n/a nM
Citation Galley, GGroebke Zbinden, KNorcross, RStalder, H 2-aminooxazolines as TAAR1 ligands US Patent US8604061 Publication Date 12/10/2013
 
Trace amine-associated receptor 1
Name:Trace amine-associated receptor 1
Type:Protein
Mol. Mass.:37635.41
Organism:Mus musculus (Mouse)
Description:Q923Y8
Residue:332
BDBM109462
NameBDBM109462
Synonyms:US8604061, 201
TypeSmall organic molecule
Emp. Form.C9H8Cl2N2O
Mol. Mass.231.079
SMILESNC1=N[C@H](CO1)c1cc(Cl)cc(Cl)c1