Reaction Details
TargetEnteropeptidase
LigandBDBM109707
Substrate/Competitorn/a
Meas. Tech.Inhibition Assay
Ki 0.14±0.0 nM
Citation Konishi, ATokumasu, MSuzuki, TKoshiba, TOhsumi, KIkehara, OKodama, Y Heteroarylcarboxylic acid ester derivative US Patent US8609715 Publication Date 12/17/2013
 
Enteropeptidase
Name:Enteropeptidase
Type:Enzyme
Mol. Mass.:112901.62
Organism:Homo sapiens (Human)
Description:P98073
Residue:1019
BDBM109707
NameBDBM109707
Synonyms:US8609715, B-64
TypeSmall organic molecule
Emp. Form.C21H22FN3O7S
Mol. Mass.479.479
SMILESCC(C)(Cc1ccc(s1)C(=O)Oc1ccc(cc1F)C(N)=N)C(=O)N[C@@H](CC(O)=O)C(O)=O