Reaction Details
TargetSerine protease 1
LigandBDBM109663
Substrate/Competitorn/a
Meas. Tech.Inhibition Assay
Ki 0.054±0.0 nM
Citation Konishi, ATokumasu, MSuzuki, TKoshiba, TOhsumi, KIkehara, OKodama, Y Heteroarylcarboxylic acid ester derivative US Patent US8609715 Publication Date 12/17/2013
 
Serine protease 1
Name:Serine protease 1
Type:Enzyme
Mol. Mass.:26557.80
Organism:Homo sapiens (Human)
Description:P07477
Residue:247
BDBM109663
NameBDBM109663
Synonyms:US8609715, A-71
TypeSmall organic molecule
Emp. Form.C23H19N3O8
Mol. Mass.465.4123
SMILESNC(=N)c1ccc(OC(=O)c2ccc(o2)-c2cccc(c2)C(=O)N[C@@H](CC(O)=O)C(O)=O)cc1