Reaction Details
TargetSerine protease 1
LigandBDBM109684
Substrate/Competitorn/a
Meas. Tech.Inhibition Assay
Ki 0.21±0.0 nM
Citation Konishi, ATokumasu, MSuzuki, TKoshiba, TOhsumi, KIkehara, OKodama, Y Heteroarylcarboxylic acid ester derivative US Patent US8609715 Publication Date 12/17/2013
 
Serine protease 1
Name:Serine protease 1
Type:Enzyme
Mol. Mass.:26557.80
Organism:Homo sapiens (Human)
Description:P07477
Residue:247
BDBM109684
NameBDBM109684
Synonyms:US8609715, B-41
TypeSmall organic molecule
Emp. Form.C19H20FN3O8S2
Mol. Mass.501.506
SMILESCC(Cc1ccc(s1)C(=O)Oc1ccc(cc1F)C(N)=N)C(=O)N[C@@H](CS(O)(=O)=O)C(O)=O