Reaction Details
TargetSerine protease 1
LigandBDBM109685
Substrate/Competitorn/a
Meas. Tech.Inhibition Assay
Ki 0.22±0.0 nM
Citation Konishi, ATokumasu, MSuzuki, TKoshiba, TOhsumi, KIkehara, OKodama, Y Heteroarylcarboxylic acid ester derivative US Patent US8609715 Publication Date 12/17/2013
 
Serine protease 1
Name:Serine protease 1
Type:Enzyme
Mol. Mass.:26557.80
Organism:Homo sapiens (Human)
Description:P07477
Residue:247
BDBM109685
NameBDBM109685
Synonyms:US8609715, B-42
TypeSmall organic molecule
Emp. Form.C17H19FN3O6PS
Mol. Mass.443.386
SMILESCC(Cc1ccc(s1)C(=O)Oc1ccc(cc1F)C(N)=N)C(=O)NCP(O)(O)=O