Reaction Details
TargetSerine protease 1
LigandBDBM109692
Substrate/Competitorn/a
Meas. Tech.Inhibition Assay
Ki 0.18±0.0 nM
Citation Konishi, ATokumasu, MSuzuki, TKoshiba, TOhsumi, KIkehara, OKodama, Y Heteroarylcarboxylic acid ester derivative US Patent US8609715 Publication Date 12/17/2013
 
Serine protease 1
Name:Serine protease 1
Type:Enzyme
Mol. Mass.:26557.80
Organism:Homo sapiens (Human)
Description:P07477
Residue:247
BDBM109692
NameBDBM109692
Synonyms:US8609715, B-49
TypeSmall organic molecule
Emp. Form.C22H24FN3O7S
Mol. Mass.493.505
SMILESCC(CCC(=O)N[C@@H](CC(O)=O)C(O)=O)Cc1ccc(s1)C(=O)Oc1ccc(cc1F)C(N)=N