Reaction Details
TargetCytochrome P450 2A6
LigandBDBM50113851
Substrate/Competitorn/a
Meas. Tech.Inhibition Assay
IC50 8e+1± 1e+1 nM
Citation Cashman, JR Synthetic compounds and derivatives as modulators of smoking or nicotine ingestion and lung cancer US Patent US8609708 Publication Date 12/17/2013
 
Cytochrome P450 2A6
Name:Cytochrome P450 2A6
Type:Protein
Mol. Mass.:56514.34
Organism:Homo sapiens (Human)
Description:P11509
Residue:494
BDBM50113851
NameBDBM50113851
Synonyms:(+/-)-Tranylcypromine 2-Phenyl-cyclopropylamine CHEMBL313833 Tranylcypromine,(+) US8609708, 6 Tranyl- cypromine | US8609708, 6 Tranylcypromine
TypeSmall organic molecule
Emp. Form.C9H11N
Mol. Mass.133.1903
SMILESNC1CC1c1ccccc1