Reaction Details
TargetMelanin-concentrating hormone receptor 1
LigandBDBM109790
Substrate/Competitorn/a
Meas. Tech.Binding Assay
Ki 20±0.0 nM
Citation Guzzo, PRSurman, MDHenderson, AJJiang, MX Azinone-substituted azapolycycle MCH-1 antagonists, methods of making, and use thereof US Patent US8618299 Publication Date 12/31/2013
 
Melanin-concentrating hormone receptor 1
Name:Melanin-concentrating hormone receptor 1
Type:G Protein-Coupled Receptor (GPCR)
Mol. Mass.:45976.27
Organism:Homo sapiens (Human)
Description:Membranes from CHO-K1 cells stably expressing human MCH1R were used in assays.
Residue:422
BDBM109790
NameBDBM109790
Synonyms:US8618299, 8
TypeSmall organic molecule
Emp. Form.C27H27ClN4O2
Mol. Mass.474.982
SMILESCn1c2C3CCCCN3CCc2c2ccc(cc12)-n1ccc(OCc2ccc(Cl)cn2)cc1=O